New Paste

 

Recent Pastes

Administrate




Pastebin on p.luis.im

PasteID: 7b1
Pasted by Anonymous, 2020-02-25 01:03:55 GMT
Expires Never
Paste size 26.39 Kb
Tools Raw   Download
 
  1. [vagrant@archlinux opencv-cuda-git]$ makepkg -s  
  2. ==> Making package: opencv-cuda-git 4.2.0.r323.g43a907ddda-1 (Tue 25 Feb 2020 12:03:08 PM AEDT)  
  3. ==> Checking runtime dependencies...  
  4. ==> Checking buildtime dependencies...  
  5. ==> Retrieving sources...  
  6.   -> Updating opencv git repo...  
  7. Fetching origin  
  8.   -> Updating opencv_contrib git repo...  
  9. Fetching origin  
  10. ==> Validating source files with sha256sums...  
  11.     opencv ... Skipped  
  12.     opencv_contrib ... Skipped  
  13. ==> Extracting sources...  
  14.   -> Creating working copy of opencv git repo...  
  15. Reset branch 'makepkg'  
  16.   -> Creating working copy of opencv_contrib git repo...  
  17. Reset branch 'makepkg'  
  18. ==> Starting prepare()...  
  19. ==> Starting pkgver()...  
  20. ==> Removing existing $pkgdir/ directory...  
  21. ==> Starting build()...  
  22. -- Detected processor: x86_64  
  23. -- WARNING: Option ENABLE_SSE3='OFF' is deprecated and should not be used anymore  
  24. --          Behaviour of this option is not backward compatible  
  25. --          Refer to 'CPU_BASELINE'/'CPU_DISPATCH' CMake options documentation  
  26. -- Optimization SSE3 is not available, skipped  
  27. -- Found ZLIB: /lib64/libz.so (found suitable version "1.2.11", minimum required is "1.2.3")   
  28. -- Found ZLIB: /lib64/libz.so (found version "1.2.11")   
  29. -- Found OpenEXR: /usr/lib/libIlmImf-2_4.so  
  30. -- Found TBB (cmake): /usr/lib/libtbb.so.2  
  31. -- found Intel IPP (ICV version): 2019.0.0 [2019.0.0 Gold]  
  32. -- at: /home/vagrant/opencv-cuda-git/src/opencv/build/3rdparty/ippicv/ippicv_lnx/icv  
  33. -- found Intel IPP Integration Wrappers sources: 2019.0.0  
  34. -- at: /home/vagrant/opencv-cuda-git/src/opencv/build/3rdparty/ippicv/ippicv_lnx/iw  
  35. -- Could NOT find CUDNN (missing: CUDNN_LIBRARY CUDNN_INCLUDE_DIR) (Required is at least version "7.5")  
  36. -- CUDA detected: 10.2  
  37. -- CUDA NVCC target flags: -std=c++11 -Xcompiler -D__CORRECT_ISO_CPP11_MATH_H_PROTO --expt-relaxed-constexpr;-gencode;arch=compute_30,code=sm_30;-gencode;arch=compute_35,code=sm_35;-gencode;arch=compute_37,code=sm_37;-gencode;arch=compute_50,code=sm_50;-gencode;arch=compute_52,code=sm_52;-gencode;arch=compute_60,code=sm_60;-gencode;arch=compute_61,code=sm_61;-gencode;arch=compute_70,code=sm_70;-gencode;arch=compute_75,code=sm_75;-D_FORCE_INLINES  
  38. -- LAPACK(LAPACK/Generic): LAPACK_LIBRARIES: /lib64/liblapack.so;/lib64/libblas.so  
  39. -- LAPACK(LAPACK/Generic): Support is enabled.  
  40. -- Found apache ant: /bin/ant (1.10.7)  
  41. -- Found VTK 8.2.0 (/usr/lib/cmake/vtk-8.2/UseVTK.cmake)  
  42. -- OpenCV Python: during development append to PYTHONPATH: /home/vagrant/opencv-cuda-git/src/opencv/build/python_loader  
  43. -- Checking for module 'libavresample'  
  44. --   Package 'libavresample', required by 'virtual:world', not found  
  45. -- Caffe:   NO  
  46. -- Protobuf:   NO  
  47. -- Glog:   YES  
  48. -- freetype2:   YES (ver 23.1.17)  
  49. -- harfbuzz:    YES (ver 2.6.4)  
  50. -- HDF5: Using hdf5 compiler wrapper to determine C configuration  
  51. -- Module opencv_ovis disabled because OGRE3D was not found  
  52. -- No preference for use of exported gflags CMake configuration set, and no hints for include/library directories provided. Defaulting to preferring an installed/exported gflags CMake configuration if available.  
  53. -- Failed to find installed gflags CMake configuration, searching for gflags build directories exported with CMake.  
  54. -- Failed to find gflags - Failed to find an installed/exported CMake configuration for gflags, will perform search for installed gflags components.  
  55. -- Failed to find gflags - Could not find gflags include directory, set GFLAGS_INCLUDE_DIR to directory containing gflags/gflags.h  
  56. -- Found installed version of Eigen: /usr/share/eigen3/cmake  
  57. -- Found required Ceres dependency: Eigen version 3.3.7 in /usr/include/eigen3  
  58. -- Found required Ceres dependency: glog  
  59. -- Ceres version 1.14.0 detected here: /usr was built with C++11. Ceres target will add C++11 flags to compile options for targets using it.  
  60. -- Found Ceres version: 1.14.0 installed in: /usr with components: [EigenSparse, SparseLinearAlgebraLibrary, LAPACK, SuiteSparse, CXSparse, SchurSpecializations, C++11, OpenMP, Multithreading]  
  61. -- Module opencv_sfm disabled because the following dependencies are not found: Glog/Gflags  
  62. -- Checking for module 'tesseract'  
  63. --   Package 'tesseract', required by 'virtual:world', not found  
  64. -- Tesseract:   NO  
  65. -- HDF5: Using hdf5 compiler wrapper to determine C configuration  
  66. -- Registering hook 'INIT_MODULE_SOURCES_opencv_dnn': /home/vagrant/opencv-cuda-git/src/opencv/modules/dnn/cmake/hooks/INIT_MODULE_SOURCES_opencv_dnn.cmake  
  67. -- opencv_dnn: filter out cuda4dnn source code  
  68. --   
  69. -- General configuration for OpenCV 4.2.0-dev =====================================  
  70. --   Version control:               4.2.0-323-g43a907ddda  
  71. --   
  72. --   Extra modules:  
  73. --     Location (extra):            /home/vagrant/opencv-cuda-git/src/opencv_contrib/modules  
  74. --     Version control (extra):     4.2.0-25-gbdfd1e75  
  75. --   
  76. --   Platform:  
  77. --     Timestamp:                   2020-02-24T23:11:34Z  
  78. --     Host:                        Linux 5.5.3-arch1-1 x86_64  
  79. --     CMake:                       3.16.4  
  80. --     CMake generator:             Unix Makefiles  
  81. --     CMake build tool:            /usr/bin/make  
  82. --     Configuration:               Release  
  83. --   
  84. --   CPU/HW features:  
  85. --     Baseline:                    SSE SSE2  
  86. --       requested:                 SSE3  
  87. --       disabled:                  SSE3  
  88. --     Dispatched code generation:  SSE4_1 SSE4_2 FP16 AVX AVX2 AVX512_SKX  
  89. --       requested:                 SSE4_1 SSE4_2 AVX FP16 AVX2 AVX512_SKX  
  90. --       SSE4_1 (14 files):         + SSE3 SSSE3 SSE4_1  
  91. --       SSE4_2 (1 files):          + SSE3 SSSE3 SSE4_1 POPCNT SSE4_2  
  92. --       FP16 (0 files):            + SSE3 SSSE3 SSE4_1 POPCNT SSE4_2 FP16 AVX  
  93. --       AVX (4 files):             + SSE3 SSSE3 SSE4_1 POPCNT SSE4_2 AVX  
  94. --       AVX2 (28 files):           + SSE3 SSSE3 SSE4_1 POPCNT SSE4_2 FP16 FMA3 AVX AVX2  
  95. --       AVX512_SKX (3 files):      + SSE3 SSSE3 SSE4_1 POPCNT SSE4_2 FP16 FMA3 AVX AVX2 AVX_512F AVX512_COMMON AVX512_SKX  
  96. --   
  97. --   C/C++:  
  98. --     Built as dynamic libs?:      YES  
  99. --     C++ standard:                11  
  100. --     C++ Compiler:                /usr/lib/ccache/bin/c++  (ver 9.2.1)  
  101. --     C++ flags (Release):         -std=c++11   -fsigned-char -ffast-math -W -Wall -Werror=return-type -Werror=non-virtual-dtor -Werror=address -Werror=sequence-point -Wformat -Werror=format-security -Wmissing-declarations -Wundef -Winit-self -Wpointer-arith -Wshadow -Wsign-promo -Wuninitialized -Winit-self -Wsuggest-override -Wno-delete-non-virtual-dtor -Wno-comment -Wimplicit-fallthrough=3 -Wno-strict-overflow -fdiagnostics-show-option -Wno-long-long -pthread -fomit-frame-pointer -ffunction-sections -fdata-sections  -msse -msse2 -fvisibility=hidden -fvisibility-inlines-hidden -O3 -DNDEBUG  -DNDEBUG  
  102. --     C++ flags (Debug):           -std=c++11   -fsigned-char -ffast-math -W -Wall -Werror=return-type -Werror=non-virtual-dtor -Werror=address -Werror=sequence-point -Wformat -Werror=format-security -Wmissing-declarations -Wundef -Winit-self -Wpointer-arith -Wshadow -Wsign-promo -Wuninitialized -Winit-self -Wsuggest-override -Wno-delete-non-virtual-dtor -Wno-comment -Wimplicit-fallthrough=3 -Wno-strict-overflow -fdiagnostics-show-option -Wno-long-long -pthread -fomit-frame-pointer -ffunction-sections -fdata-sections  -msse -msse2 -fvisibility=hidden -fvisibility-inlines-hidden -g  -O0 -DDEBUG -D_DEBUG  
  103. --     C Compiler:                  /usr/lib/ccache/bin/cc  
  104. --     C flags (Release):           -march=x86-64 -mtune=generic -O2 -pipe -fno-plt   -fsigned-char -ffast-math -W -Wall -Werror=return-type -Werror=address -Werror=sequence-point -Wformat -Werror=format-security -Wmissing-declarations -Wmissing-prototypes -Wstrict-prototypes -Wundef -Winit-self -Wpointer-arith -Wshadow -Wuninitialized -Winit-self -Wno-comment -Wimplicit-fallthrough=3 -Wno-strict-overflow -fdiagnostics-show-option -Wno-long-long -pthread -fomit-frame-pointer -ffunction-sections -fdata-sections  -msse -msse2 -fvisibility=hidden -O3 -DNDEBUG  -DNDEBUG  
  105. --     C flags (Debug):             -march=x86-64 -mtune=generic -O2 -pipe -fno-plt   -fsigned-char -ffast-math -W -Wall -Werror=return-type -Werror=address -Werror=sequence-point -Wformat -Werror=format-security -Wmissing-declarations -Wmissing-prototypes -Wstrict-prototypes -Wundef -Winit-self -Wpointer-arith -Wshadow -Wuninitialized -Winit-self -Wno-comment -Wimplicit-fallthrough=3 -Wno-strict-overflow -fdiagnostics-show-option -Wno-long-long -pthread -fomit-frame-pointer -ffunction-sections -fdata-sections  -msse -msse2 -fvisibility=hidden -g  -O0 -DDEBUG -D_DEBUG  
  106. --     Linker flags (Release):      -Wl,--exclude-libs,libippicv.a -Wl,--exclude-libs,libippiw.a -Wl,-O1,--sort-common,--as-needed,-z,relro,-z,now  -Wl,--gc-sections -Wl,--as-needed    
  107. --     Linker flags (Debug):        -Wl,--exclude-libs,libippicv.a -Wl,--exclude-libs,libippiw.a -Wl,-O1,--sort-common,--as-needed,-z,relro,-z,now  -Wl,--gc-sections -Wl,--as-needed    
  108. --     ccache:                      YES  
  109. --     Precompiled headers:         NO  
  110. --     Extra dependencies:          m pthread cudart_static -lpthread dl rt nppc nppial nppicc nppicom nppidei nppif nppig nppim nppist nppisu nppitc npps cublas cufft -L/opt/cuda/lib64 -L/lib64  
  111. --     3rdparty dependencies:  
  112. --   
  113. --   OpenCV modules:  
  114. --     To be built:                 aruco bgsegm bioinspired calib3d ccalib core cudaarithm cudabgsegm cudacodec cudafeatures2d cudafilters cudaimgproc cudalegacy cudaobjdetect cudaoptflow cudastereo cudawarping cudev datasets dnn dnn_objdetect dnn_superres dpm face features2d flann freetype fuzzy gapi hdf hfs highgui img_hash imgcodecs imgproc intensity_transform java line_descriptor ml objdetect optflow phase_unwrapping photo plot python3 quality rapid reg rgbd saliency shape stereo stitching structured_light superres surface_matching text tracking video videoio videostab viz xfeatures2d ximgproc xobjdetect xphoto  
  115. --     Disabled:                    world  
  116. --     Disabled by dependency:      -  
  117. --     Unavailable:                 cnn_3dobj cvv js matlab ovis python2 sfm ts  
  118. --     Applications:                apps  
  119. --     Documentation:               NO  
  120. --     Non-free algorithms:         NO  
  121. --   
  122. --   GUI:   
  123. --     GTK+:                        YES (ver 3.24.14)  
  124. --       GThread :                  YES (ver 2.62.4)  
  125. --       GtkGlExt:                  NO  
  126. --     OpenGL support:              NO  
  127. --     VTK support:                 YES (ver 8.2.0)  
  128. --   
  129. --   Media I/O:   
  130. --     ZLib:                        /lib64/libz.so (ver 1.2.11)  
  131. --     JPEG:                        /lib64/libjpeg.so (ver 80)  
  132. --     WEBP:                        /lib64/libwebp.so (ver encoder: 0x020f)  
  133. --     PNG:                         /lib64/libpng.so (ver 1.6.37)  
  134. --     TIFF:                        /lib64/libtiff.so (ver 42 / 4.1.0)  
  135. --     JPEG 2000:                   /lib64/libjasper.so (ver 2.0.16)  
  136. --     OpenEXR:                     /usr/lib/libImath-2_4.so /usr/lib/libIlmImf-2_4.so /usr/lib/libIex-2_4.so /usr/lib/libHalf-2_4.so /usr/lib/libIlmThread-2_4.so (ver 2_4)  
  137. --     HDR:                         YES  
  138. --     SUNRASTER:                   YES  
  139. --     PXM:                         YES  
  140. --     PFM:                         YES  
  141. --   
  142. --   Video I/O:  
  143. --     DC1394:                      YES (2.2.6)  
  144. --     FFMPEG:                      YES  
  145. --       avcodec:                   YES (58.54.100)  
  146. --       avformat:                  YES (58.29.100)  
  147. --       avutil:                    YES (56.31.100)  
  148. --       swscale:                   YES (5.5.100)  
  149. --       avresample:                NO  
  150. --     GStreamer:                   YES (1.16.2)  
  151. --     v4l/v4l2:                    YES (linux/videodev2.h)  
  152. --     Xine:                        YES (ver 1.2.10)  
  153. --   
  154. --   Parallel framework:            TBB (ver 2020.1 interface 11101)  
  155. --   
  156. --   Trace:                         YES (with Intel ITT)  
  157. --   
  158. --   Other third-party libraries:  
  159. --     Intel IPP:                   2019.0.0 Gold [2019.0.0]  
  160. --            at:                   /home/vagrant/opencv-cuda-git/src/opencv/build/3rdparty/ippicv/ippicv_lnx/icv  
  161. --     Intel IPP IW:                sources (2019.0.0)  
  162. --               at:                /home/vagrant/opencv-cuda-git/src/opencv/build/3rdparty/ippicv/ippicv_lnx/iw  
  163. --     Lapack:                      YES (/lib64/liblapack.so /lib64/libblas.so)  
  164. --     Eigen:                       YES (ver 3.3.7)  
  165. --     Custom HAL:                  NO  
  166. --     Protobuf:                    build (3.5.1)  
  167. --   
  168. --   NVIDIA CUDA:                   YES (ver 10.2, CUFFT CUBLAS NVCUVID FAST_MATH)  
  169. --     NVIDIA GPU arch:             30 35 37 50 52 60 61 70 75  
  170. --     NVIDIA PTX archs:  
  171. --   
  172. --   cuDNN:                         NO  
  173. --   
  174. --   OpenCL:                        YES (no extra features)  
  175. --     Include path:                /home/vagrant/opencv-cuda-git/src/opencv/3rdparty/include/opencl/1.2  
  176. --     Link libraries:              Dynamic load  
  177. --   
  178. --   Python 2:  
  179. --     Interpreter:                 /usr/bin/python2.7 (ver 2.7.17)  
  180. --     Libraries:                   NO  
  181. --     numpy:                       NO (Python wrappers can not be generated)  
  182. --     install path:                -  
  183. --   
  184. --   Python 3:  
  185. --     Interpreter:                 /usr/bin/python3 (ver 3.8.1)  
  186. --     Libraries:                   /lib64/libpython3.8.so (ver 3.8.1)  
  187. --     numpy:                       /usr/lib/python3.8/site-packages/numpy/core/include (ver 1.18.1)  
  188. --     install path:                lib/python3.8/site-packages/cv2/python-3.8  
  189. --   
  190. --   Python (for build):            /usr/bin/python2.7  
  191. --   
  192. --   Java:                            
  193. --     ant:                         /bin/ant (ver 1.10.7)  
  194. --     JNI:                         /usr/lib/jvm/default/include /usr/lib/jvm/default/include/linux /usr/lib/jvm/default/include  
  195. --     Java wrappers:               YES  
  196. --     Java tests:                  NO  
  197. --   
  198. --   Install to:                    /usr  
  199. -- -----------------------------------------------------------------  
  200. --   
  201. -- Configuring done  
  202. -- Generating done  
  203. -- Build files have been written to: /home/vagrant/opencv-cuda-git/src/opencv/build  
  204. make[1]: Entering directory '/home/vagrant/opencv-cuda-git/src/opencv/build'  
  205. make[2]: Entering directory '/home/vagrant/opencv-cuda-git/src/opencv/build'  
  206. make[2]: Entering directory '/home/vagrant/opencv-cuda-git/src/opencv/build'  
  207. make[2]: Entering directory '/home/vagrant/opencv-cuda-git/src/opencv/build'  
  208. make[2]: Entering directory '/home/vagrant/opencv-cuda-git/src/opencv/build'  
  209. make[2]: Leaving directory '/home/vagrant/opencv-cuda-git/src/opencv/build'  
  210. make[2]: Leaving directory '/home/vagrant/opencv-cuda-git/src/opencv/build'  
  211. make[2]: Entering directory '/home/vagrant/opencv-cuda-git/src/opencv/build'  
  212. make[2]: Leaving directory '/home/vagrant/opencv-cuda-git/src/opencv/build'  
  213. make[2]: Leaving directory '/home/vagrant/opencv-cuda-git/src/opencv/build'  
  214. make[2]: Leaving directory '/home/vagrant/opencv-cuda-git/src/opencv/build'  
  215. [  2%] Built target ippiw  
  216. [  3%] Built target ittnotify  
  217. [  4%] Built target quirc  
  218. make[2]: Entering directory '/home/vagrant/opencv-cuda-git/src/opencv/build'  
  219. make[2]: Entering directory '/home/vagrant/opencv-cuda-git/src/opencv/build'  
  220. [  5%] Built target ade  
  221. make[2]: Entering directory '/home/vagrant/opencv-cuda-git/src/opencv/build'  
  222. make[2]: Entering directory '/home/vagrant/opencv-cuda-git/src/opencv/build'  
  223. make[2]: Leaving directory '/home/vagrant/opencv-cuda-git/src/opencv/build'  
  224. make[2]: Leaving directory '/home/vagrant/opencv-cuda-git/src/opencv/build'  
  225. [ 11%] Built target libprotobuf  
  226. make[2]: Leaving directory '/home/vagrant/opencv-cuda-git/src/opencv/build'  
  227. make[2]: Leaving directory '/home/vagrant/opencv-cuda-git/src/opencv/build'  
  228. make[2]: Entering directory '/home/vagrant/opencv-cuda-git/src/opencv/build'  
  229. [ 11%] Built target opencv_videoio_plugins  
  230. [ 11%] Built target opencv_cudev  
  231. [ 11%] Built target gen_opencv_python_source  
  232. [ 11%] Generate files for Java bindings  
  233. make[2]: Entering directory '/home/vagrant/opencv-cuda-git/src/opencv/build'  
  234. make[2]: Leaving directory '/home/vagrant/opencv-cuda-git/src/opencv/build'  
  235. JAVA: Processing OpenCV modules: 25  
  236. [ 19%] Built target opencv_core  
  237. make[2]: Entering directory '/home/vagrant/opencv-cuda-git/src/opencv/build'  
  238. make[2]: Entering directory '/home/vagrant/opencv-cuda-git/src/opencv/build'  
  239. make[2]: Leaving directory '/home/vagrant/opencv-cuda-git/src/opencv/build'  
  240. make[2]: Leaving directory '/home/vagrant/opencv-cuda-git/src/opencv/build'  
  241. make[2]: Entering directory '/home/vagrant/opencv-cuda-git/src/opencv/build'  
  242. [ 19%] Built target opencv_flann  
  243. [ 19%] Built target opencv_hdf  
  244. make[2]: Leaving directory '/home/vagrant/opencv-cuda-git/src/opencv/build'  
  245. make[2]: Entering directory '/home/vagrant/opencv-cuda-git/src/opencv/build'  
  246. make[2]: Entering directory '/home/vagrant/opencv-cuda-git/src/opencv/build'  
  247. duplicated: CLASS cv::.Algorithm :   
  248. make[2]: Leaving directory '/home/vagrant/opencv-cuda-git/src/opencv/build'  
  249. make[2]: Entering directory '/home/vagrant/opencv-cuda-git/src/opencv/build'  
  250. make[2]: Leaving directory '/home/vagrant/opencv-cuda-git/src/opencv/build'  
  251. make[2]: Leaving directory '/home/vagrant/opencv-cuda-git/src/opencv/build'  
  252. [ 19%] Built target opencv_intensity_transform  
  253. [ 20%] Built target opencv_ml  
  254. make[2]: Entering directory '/home/vagrant/opencv-cuda-git/src/opencv/build'  
  255. [ 23%] Built target opencv_cudaarithm  
  256. make[2]: Leaving directory '/home/vagrant/opencv-cuda-git/src/opencv/build'  
  257. make[2]: Entering directory '/home/vagrant/opencv-cuda-git/src/opencv/build'  
  258. make[2]: Entering directory '/home/vagrant/opencv-cuda-git/src/opencv/build'  
  259. make[2]: Leaving directory '/home/vagrant/opencv-cuda-git/src/opencv/build'  
  260. make[2]: Entering directory '/home/vagrant/opencv-cuda-git/src/opencv/build'  
  261. make[2]: Leaving directory '/home/vagrant/opencv-cuda-git/src/opencv/build'  
  262. [ 24%] Built target opencv_surface_matching  
  263. [ 24%] Linking CXX executable ../../bin/opencv_version  
  264. [ 31%] Built target opencv_imgproc  
  265. make[2]: Entering directory '/home/vagrant/opencv-cuda-git/src/opencv/build'  
  266. make[2]: Entering directory '/home/vagrant/opencv-cuda-git/src/opencv/build'  
  267. Scanning dependencies of target opencv_phase_unwrapping  
  268. [ 32%] Built target opencv_viz  
  269. Scanning dependencies of target opencv_plot  
  270. make[2]: Leaving directory '/home/vagrant/opencv-cuda-git/src/opencv/build'  
  271. make[2]: Leaving directory '/home/vagrant/opencv-cuda-git/src/opencv/build'  
  272. make[2]: Entering directory '/home/vagrant/opencv-cuda-git/src/opencv/build'  
  273. make[2]: Entering directory '/home/vagrant/opencv-cuda-git/src/opencv/build'  
  274. Scanning dependencies of target opencv_quality  
  275. make[2]: Entering directory '/home/vagrant/opencv-cuda-git/src/opencv/build'  
  276. [ 32%] Building CXX object modules/plot/CMakeFiles/opencv_plot.dir/src/plot.cpp.o  
  277. [ 32%] Building CXX object modules/phase_unwrapping/CMakeFiles/opencv_phase_unwrapping.dir/src/histogramphaseunwrapping.cpp.o  
  278. make[2]: Leaving directory '/home/vagrant/opencv-cuda-git/src/opencv/build'  
  279. make[2]: Entering directory '/home/vagrant/opencv-cuda-git/src/opencv/build'  
  280. [ 32%] Building CXX object modules/quality/CMakeFiles/opencv_quality.dir/src/qualitybrisque.cpp.o  
  281. SKIP:void cv::Algorithm::read(FileNode fn)	 due to ARG type FileNode/I  
  282. SKIP:void cv::Algorithm::write(Ptr_FileStorage fs, String name = String())	 due to ARG type Ptr_FileStorage/I  
  283. /usr/bin/ld: ../../lib/libopencv_core.so.4.2.0: undefined reference to `cblas_zgemm'  
  284. /usr/bin/ld: ../../lib/libopencv_core.so.4.2.0: undefined reference to `cblas_sgemm'  
  285. /usr/bin/ld: ../../lib/libopencv_core.so.4.2.0: undefined reference to `cblas_dgemm'  
  286. /usr/bin/ld: ../../lib/libopencv_core.so.4.2.0: undefined reference to `cblas_cgemm'  
  287. collect2: error: ld returned 1 exit status  
  288. make[2]: *** [apps/version/CMakeFiles/opencv_version.dir/build.make:88: bin/opencv_version] Error 1  
  289. make[2]: Leaving directory '/home/vagrant/opencv-cuda-git/src/opencv/build'  
  290. make[1]: *** [CMakeFiles/Makefile2:6339: apps/version/CMakeFiles/opencv_version.dir/all] Error 2  
  291. make[1]: *** Waiting for unfinished jobs....  
  292. [ 32%] Building CXX object modules/quality/CMakeFiles/opencv_quality.dir/src/qualitygmsd.cpp.o  
  293. SKIP:AsyncArray cv::dnn::Net::forwardAsync(String outputName = String())	 due to RET type AsyncArray  
  294. SKIP:void cv::dnn::Net::forward(vector_vector_Mat& outputBlobs, vector_String outBlobNames)	 due to ARG type vector_vector_Mat/O  
  295. SKIP:void cv::dnn::Net::getLayersShapes(MatShape netInputShape, vector_int& layersIds, vector_vector_MatShape& inLayersShapes, vector_vector_MatShape& outLayersShapes)	 due to ARG type vector_vector_MatShape/O  
  296. SKIP:void cv::dnn::Net::getLayersShapes(vector_MatShape netInputShapes, vector_int& layersIds, vector_vector_MatShape& inLayersShapes, vector_vector_MatShape& outLayersShapes)	 due to ARG type vector_vector_MatShape/O  
  297. SKIP:cv::BOWImgDescriptorExtractor::BOWImgDescriptorExtractor(Ptr_DescriptorExtractor dextractor, Ptr_DescriptorMatcher dmatcher)	 due to ARG type Ptr_DescriptorExtractor/I  
  298. SKIP:void cv::Feature2D::read(FileNode arg1)	 due to ARG type FileNode/I  
  299. SKIP:void cv::Feature2D::write(Ptr_FileStorage fs, String name = String())	 due to ARG type Ptr_FileStorage/I  
  300. SKIP:void cv::DescriptorMatcher::read(FileNode arg1)	 due to ARG type FileNode/I  
  301. SKIP:void cv::DescriptorMatcher::write(Ptr_FileStorage fs, String name = String())	 due to ARG type Ptr_FileStorage/I  
  302. SKIP:uchar Params::blobColor	 due to RET type uchar  
  303. SKIP:void Params::blobColor	 due to ARG type uchar/I  
  304. [ 32%] Building CXX object modules/quality/CMakeFiles/opencv_quality.dir/src/qualitymse.cpp.o  
  305. [ 32%] Linking CXX shared library ../../lib/libopencv_plot.so  
  306. duplicated: CLASS cv.text::OCRBeamSearchDecoder.ClassifierCallback :   
  307. [ 32%] Building CXX object modules/quality/CMakeFiles/opencv_quality.dir/src/qualityssim.cpp.o  
  308. SKIP:Ptr_ERFilter cv::text::createERFilterNM1(Ptr_ERFilter_Callback cb, int thresholdDelta = 1, float minArea = (float)0.00025, float maxArea = (float)0.13, float minProbability = (float)0.4, bool nonMaxSuppression = true, float minProbabilityDiff = (float)0.1)	 due to ARG type Ptr_ERFilter_Callback/I  
  309. SKIP:Ptr_ERFilter cv::text::createERFilterNM2(Ptr_ERFilter_Callback cb, float minProbability = (float)0.3)	 due to ARG type Ptr_ERFilter_Callback/I  
  310. SKIP:Ptr_ERFilter_Callback cv::text::loadClassifierNM1(String filename)	 due to RET type Ptr_ERFilter_Callback  
  311. SKIP:Ptr_ERFilter_Callback cv::text::loadClassifierNM2(String filename)	 due to RET type Ptr_ERFilter_Callback  
  312. SKIP:Ptr_OCRBeamSearchDecoder_ClassifierCallback cv::text::loadOCRBeamSearchClassifierCNN(String filename)	 due to RET type Ptr_OCRBeamSearchDecoder_ClassifierCallback  
  313. SKIP:Ptr_OCRHMMDecoder_ClassifierCallback cv::text::loadOCRHMMClassifier(String filename, int classifier)	 due to RET type Ptr_OCRHMMDecoder_ClassifierCallback  
  314. SKIP:Ptr_OCRHMMDecoder_ClassifierCallback cv::text::loadOCRHMMClassifierCNN(String filename)	 due to RET type Ptr_OCRHMMDecoder_ClassifierCallback  
  315. SKIP:Ptr_OCRHMMDecoder_ClassifierCallback cv::text::loadOCRHMMClassifierNM(String filename)	 due to RET type Ptr_OCRHMMDecoder_ClassifierCallback  
  316. SKIP:static Ptr_OCRBeamSearchDecoder cv::text::OCRBeamSearchDecoder::create(Ptr_OCRBeamSearchDecoder_ClassifierCallback classifier, String vocabulary, Mat transition_probabilities_table, Mat emission_probabilities_table, int mode = OCR_DECODER_VITERBI, int beam_size = 500)	 due to ARG type Ptr_OCRBeamSearchDecoder_ClassifierCallback/I  
  317. SKIP:static Ptr_OCRHMMDecoder cv::text::OCRHMMDecoder::create(Ptr_OCRHMMDecoder_ClassifierCallback classifier, String vocabulary, Mat transition_probabilities_table, Mat emission_probabilities_table, int mode = OCR_DECODER_VITERBI)	 due to ARG type Ptr_OCRHMMDecoder_ClassifierCallback/I  
  318. SKIP:vector_VideoCaptureAPIs cv::videoio_registry::getBackends()	 due to RET type vector_VideoCaptureAPIs  
  319. SKIP:vector_VideoCaptureAPIs cv::videoio_registry::getCameraBackends()	 due to RET type vector_VideoCaptureAPIs  
  320. SKIP:vector_VideoCaptureAPIs cv::videoio_registry::getStreamBackends()	 due to RET type vector_VideoCaptureAPIs  
  321. SKIP:vector_VideoCaptureAPIs cv::videoio_registry::getWriterBackends()	 due to RET type vector_VideoCaptureAPIs  
  322. SKIP:explicit cv::VideoCapture::VideoCapture(String filename, int apiPreference = CAP_ANY)	 due to RET type explicit  
  323. SKIP:explicit cv::VideoCapture::VideoCapture(int index, int apiPreference = CAP_ANY)	 due to RET type explicit  
  324. make[2]: Leaving directory '/home/vagrant/opencv-cuda-git/src/opencv/build'  
  325. [ 32%] Built target opencv_plot  
  326. [ 32%] Linking CXX shared library ../../lib/libopencv_phase_unwrapping.so  
  327. SKIP:bool cv::findCirclesGrid(Mat image, Size patternSize, Mat& centers, int flags, Ptr_FeatureDetector blobDetector, CirclesGridFinderParameters parameters)	 due to ARG type Ptr_FeatureDetector/I  
  328. SKIP:bool cv::CascadeClassifier::read(FileNode node)	 due to ARG type FileNode/I  
  329. duplicated: CLASS cv.structured_light::SinusoidalPattern.Params :   
  330. SKIP:bool cv::structured_light::StructuredLightPattern::decode(vector_vector_Mat patternImages, Mat& disparityMap, vector_Mat blackImages = vector_Mat(), vector_Mat whiteImages = vector_Mat(), int flags = DECODE_3D_UNDERWORLD)	 due to ARG type vector_vector_Mat/I  
  331. make[2]: Leaving directory '/home/vagrant/opencv-cuda-git/src/opencv/build'  
  332. [ 32%] Built target opencv_phase_unwrapping  
  333. SKIP:void cv::cuda::SURF_CUDA::detect(GpuMat img, GpuMat mask, GpuMat& keypoints)	 due to ARG type GpuMat/I  
  334. SKIP:void cv::cuda::SURF_CUDA::detectWithDescriptors(GpuMat img, GpuMat mask, GpuMat& keypoints, GpuMat& descriptors, bool useProvidedKeypoints = false)	 due to ARG type GpuMat/I  
  335. SKIP:void cv::cuda::SURF_CUDA::downloadKeypoints(GpuMat keypointsGPU, vector_KeyPoint& keypoints)	 due to ARG type GpuMat/I  
  336. SKIP:Vec4i cv::ximgproc::HoughPoint2Line(Point houghPoint, Mat srcImgInfo, int angleRange = ARO_315_135, int makeSkew = HDO_DESKEW, int rules = RO_IGNORE_BORDERS)	 due to RET type Vec4i  
  337. SKIP:vector_vector_int CharucoBoard::nearestMarkerIdx	 due to RET type vector_vector_int  
  338. SKIP:vector_vector_int CharucoBoard::nearestMarkerCorners	 due to RET type vector_vector_int  
  339. [ 32%] Linking CXX shared library ../../lib/libopencv_quality.so  
  340. SKIP:vector_pair_int_and_double cv::face::StandardCollector::getResults(bool sorted = false)	 due to RET type vector_pair_int_and_double  
  341. Generated files: 367 (updated 367)  
  342. make[2]: Leaving directory '/home/vagrant/opencv-cuda-git/src/opencv/build'  
  343. [ 32%] Built target gen_opencv_java_source  
  344. make[2]: Leaving directory '/home/vagrant/opencv-cuda-git/src/opencv/build'  
  345. [ 32%] Built target opencv_quality  
  346. make[1]: Leaving directory '/home/vagrant/opencv-cuda-git/src/opencv/build'  
  347. make: *** [Makefile:163: all] Error 2  
  348. ==> ERROR: A failure occurred in build().  
  349.     Aborting...  
  350.  
 
 
 
 
Written by Xan Manning, 2010.